{"text_format":"1","workbook":"xlsx","n_sheets":4,"sheets":["Part Matrix","Master","Configurator","BOM_Summary"],"not_rendered":{"charts":0,"images":4,"macros":1,"external_links":0,"defined_names":8,"comments":0,"pivot_tables":1},"unopened":[],"bounds":{"document_bytes":16777216,"sheet_cells":100000,"rows_first":2000,"rows_last":500,"rows_between":2000,"halvings":0,"cell_chars":16384,"cell_head_chars":4096},"cells_cut":0,"cells_raw":0,"read":"whole","date_system":"1900"}

{"sheet":"Part Matrix","index":0,"n_rows":44,"n_cols":45,"rows_kept":44,"cut":false,"hidden":true,"merged":[]}
["Plug","Receptacle","Connector","Inlet","AWG","Phase","Voltage","Amperage","Wires","Poles","Conductors","Conduit Trade Size","TradeSize2","WIRE","Wire1","Wire2","Wire3","Wire4","Wire5","Config","P&S Labor","Combo1","HBL Plug","HBL Recptacle","HBL Connector","Non-Metallic Back Box","Back Box Hub Size","Back Box Angle","Cast-Metal Back Box","Cable",null,"Select Conduit Color","Select Conduit Type",null,"Select Insulation Type",null,"Non-Metallic Back Box",null,"Adapter Fitting",null,"Connection Device",null,"AWG","Wires","Conduit Trade Size"]
["None","None","None","None",null,null,null,null,null,null,null,null,null,null,null,null,null,null,null,"00",null,null,null,null,null,null,null,null,null,null,null,"Blue","LFMC",null,"THHN / THWN / THWN-2",null,"None",null,"None",null,"None",{"$f":"AQ2&AR2","v":"33"},3,3,"1\""]
["320P4W","320R4W","320C4W","320B4W",12,"Single","125V",20,3,2,3,"1/2\"","1/2\"",{"$f":"\"THHN-\"&E3&\"\"","v":"THHN-12"},"Black","White","Green","N/A","N/A","01",10,{"$f":"L3&E3","v":"1/2\"12"},{"$f":"\"HBL\"&B3","v":"HBL320R4W"},{"$f":"\"HBL\"&C3","v":"HBL320C4W"},"HBL320B4W","2030N","1\" NPT","15°","BB301W (Aluminum)",{"$f":"N3&\"-\"&I3","v":"THHN-12-3"},null,"Gray","FMC",null,null,null,"2030N",null,"Straight",null,"Near End",{"$f":"AQ3&AR3","v":"34"},3,4,"1-1/4\""]
["320P6W","320R6W","320C6W","320B6W",12,"Single","250V",20,3,2,3,"1/2\"","1/2\"",{"$f":"\"THHN-\"&E4&\"\"","v":"THHN-12"},"Black","Red","Green",null,null,"02",10,{"$f":"L4&E4","v":"1/2\"12"},{"$f":"\"HBL\"&B4","v":"HBL320R6W"},{"$f":"\"HBL\"&C4","v":"HBL320C6W"},{"$f":"\"HBL\"&D4","v":"HBL320B6W"},"2030N","1\" NPT","15°","BB301W (Aluminum)",{"$f":"N4&\"-\"&I4","v":"THHN-12-3"},null,"Red",null,null,null,null,"60N",null,"90 Degrees",null,"Far End","35",3,5,"1-1/4\""]
["320P7W","320R7W","320C7W","320B7W",12,"Single","480V",20,3,2,3,"1/2\"","1/2\"","THHN-12","Brown","Orange","Green",null,null,"03",10,"1/2\"12","HBL320R7W","HBL320C7W","HBL320B7W","2030N","1\" NPT","15°","BB301W (Aluminum)","THHN-12-3",null,"Black",null,null,null,null,"100N",null,"45 Degrees",null,null,"63",6,3,"1\""]
["420P12W","420R12W","420C12W","420B12W",12,"Single","125/250V",20,4,3,3,"1/2\"","1/2\"","THHN-12","Black","Red","White","Green",null,"04",10,"1/2\"12","HBL420R12W","HBL420C12W","HBL420B12W","2030N","1\" NPT","15°","BB301W (Aluminum)","THHN-12-4",null,"Custom",null,null,null,null,null,null,null,null,null,"64",6,4,"1\""]
["420P9W","420R9W","420C9W","420B9W",12,"Three","250V",20,4,3,3,"1/2\"","1/2\"","THHN-12","Black","Red","Blue","Green",null,"05",10,"1/2\"12","HBL420R9W","HBL420C9W","HBL420B9W","2030N","1\" NPT","15°","BB301W (Aluminum)","THHN-12-4",null,null,null,null,null,null,null,null,null,null,null,"65",6,5,"1-1/4\""]
["420P7W","420R7W","420C7W","420B7W",12,"Three","480V",20,4,3,3,"1/2\"","1/2\"","THHN-12","Brown","Orange","Yellow","Green",null,"06",10,"1/2\"12","HBL420R7W","HBL420C7W","HBL420B7W","2030N","1\" NPT","15°","BB301W (Aluminum)","THHN-12-4",null,null,null,null,null,null,null,null,null,null,null,"103",10,3,"1/2\""]
["420P5W","420R5W","420C5W","420B5W",12,"Three","600V",20,4,3,3,"1/2\"","1/2\"","THHN-12","Brown","Orange","Yellow","Green",null,"07",10,"1/2\"12","HBL420R5W","HBL420C5W","HBL420B5W","2030N","1\" NPT","15°","BB301W (Aluminum)","THHN-12-4",null,null,null,null,null,null,null,null,null,null,null,"104",10,4,"0.75\""]
["520P9W","520R9W","520C9W","520B9W",12,"Three","120/208V",20,5,4,3,"1/2\"","1/2\"","THHN-12","Black","Red","Blue","White","Green","08",10,"1/2\"12","HBL520R9W","HBL520C9W","HBL520B9W","2030N","1\" NPT","15°","BB301W (Aluminum)","THHN-12-5",null,null,null,null,null,null,null,null,null,null,null,"105",10,5,"0.75\""]
{"$rows_left_out":35}
{"sheet":"Master","index":1,"n_rows":8,"n_cols":44,"rows_kept":8,"cut":false,"hidden":true,"merged":[[4,34,4,36],[4,0,4,6],[4,7,4,18],[4,19,4,22],[4,23,4,29],[4,30,4,33]]}
[]
[]
[]
[]
["GENERAL INFORMATION",null,null,null,null,null,null,"CONNECTION DEVICE",null,null,null,null,null,null,null,null,null,null,null,"ELECTRICAL SPECS",null,null,null,"CABLE DETAILS",null,null,null,null,null,null,"CONDUIT DETAILS",null,null,null,"CONNECTOR",null,null,"OTHER"]
["LINE","PROJECT NAME","LOCATION","WHIP QTY","CONFIG","CONFIG ##","CONFIG DESC","GCG PART NBR","PLUG","QTY","SELECT END","GCG PART NBR","RECEPTACLE","QTY","SELECT END","GCG PART NBR","Connector","QTY","SELECT END","VOLTAGE","AMPERAGE","PHASE","POLES","GCG PART NBR","WIRE INSULATION TYPE","LENGTH (FT)","MIN. CONDUCTOR SIZE (AWG) - CONFIRM","# WIRES","GCG PART NBR","# FERRULES","GCG PART NBR","LENGTH (FT)","COLOR","TRADE SIZE - CONFIRM","GCG PART NBR","TYPE","QTY","LABELS","QTY","LABEL INSTRUCTIONS (IF APPLCABLE)","BACK BOX","RECOMMENDED ","QTY","OTHER INSTRUCTIONS"]
["001","XahdKLaNDLKAMD;AMD;LAMD;MD;LMD;LKAJD;LKAJ;D;LMJA;LDM","LSIFHJPKSJF;SAMLF'ASLF,",10,{"$f":"IF(ISERROR(RIGHT(IF(H7<>\"none\",H7,IF(L7<>\"none\",L7,IF(P7<>\"none\",P7,\"none\"))),2)),\"\",(RIGHT(IF(H7<>\"none\",H7,IF(L7<>\"none\",L7,IF(P7<>\"none\",P7,\"none\"))),2)))","v":"01"},{"$f":"IF(AND(I7=\"None\",M7=\"None\",Q7=\"None\"),\"\",_xlfn.CONCAT(IF(I7<>\"None\",\"P\",\"\"),IF(M7<>\"None\",\"R\",\"\"),IF(Q7<>\"None\",\"C\",\"\"),SUBSTITUTE(SUBSTITUTE(T7,\"/\",\"\"),\"V\",\"\"),IF(U7<>\"\",U7,\"\"),IF(V7<>\"\",IF(V7=\"Three\",\"3\",\"S\"),\"\"),IF(W7<>\"\",W7&\"_\",\"_\"),IF(Z7<>\"\",Z7,\"\"),IF(AA7<>\"\",AA7,\"\"),IF(AB7<>\"\",AB7&\"_\",\"_\"),IF(AF7<>\"\",AF7,\"\"),IF(AG7<>\"\",LEFT(AG7,1)&\"_\",\"_\"),IF(AK7<>\"\",\"LT\",\"\"),IF(AK7<>\"\",UPPER(LEFT(AJ7,2)),\"\"),\"\"))","v":"P12520S2_50123_50B_LTAN"},{"$f":"IF(F7=\"\",\"\",IF(E7 = \"\",\"\",Z7&\"ft, \"&T7&\", \"&U7&\"A\"&\",\"&V7&\" Phase \"&W7&\"P, \"&AF7&\"ft \"&\"Conduit,\"&AG7&\" \"&AH7))","v":"50ft, 125V, 20A,Single Phase 2P, 50ft Conduit,Blue 1/2\""},{"$f":"I7&\"-\"&VLOOKUP(Master!I7,'Part Matrix'!$A:$T,20,0)","v":"320P4W-01"},"320P4W",1,"Near End",{"$f":"M7&\"-\"&VLOOKUP(Master!M7,'Part Matrix'!$B:$T,19,0)","v":"None-00"},"None",0,"Select End",{"$f":"Q7&\"-\"&VLOOKUP(Master!Q7,'Part Matrix'!$C:$T,18,0)","v":"None-00"},"None",0,"Select End",{"$f":"IF(ISERROR(INDEX('Part Matrix'!$G:$G, MATCH(E$7, 'Part Matrix'!$T:$T, 0))),\"\",(INDEX('Part Matrix'!$G:$G, MATCH(E$7, 'Part Matrix'!$T:$T, 0))))","v":"125V"},{"$f":"IF(ISERROR(INDEX('Part Matrix'!$H:$H, MATCH(E$7, 'Part Matrix'!$T:$T, 0))),\"\",(INDEX('Part Matrix'!$H:$H, MATCH(E$7, 'Part Matrix'!$T:$T, 0))))","v":20},{"$f":"IF(ISERROR(INDEX('Part Matrix'!$F:$F, MATCH(E$7, 'Part Matrix'!$T:$T, 0))),\"\",(INDEX('Part Matrix'!$F:$F, MATCH(E$7, 'Part Matrix'!$T:$T, 0))))","v":"Single"},{"$f":"IF(ISERROR(INDEX('Part Matrix'!$J:$J, MATCH(E$7, 'Part Matrix'!$T:$T, 0))),\"\",(INDEX('Part Matrix'!$J:$J, MATCH(E$7, 'Part Matrix'!$T:$T, 0))))","v":2},{"$f":"LEFT(Y7,4)&\"-\"&AA7&\"-\"&AB7","v":"THHN-12-3"},"THHN / THWN / THWN-2",50,{"$f":"IF(ISERROR(INDEX('Part Matrix'!$E:$E, MATCH(E$7, 'Part Matrix'!$T:$T, 0))),\"\",INDEX('Part Matrix'!$E:$E, MATCH(E$7, 'Part Matrix'!$T:$T, 0)))","v":12},{"$f":"IF(ISERROR(INDEX('Part Matrix'!$I:$I, MATCH(E$7, 'Part Matrix'!$T:$T, 0))),\"\",(INDEX('Part Matrix'!$I:$I, MATCH(E$7, 'Part Matrix'!$T:$T, 0))))","v":3},{"$f":"\"FER-\"&AA7","v":"FER-12"},3,{"$f":"\"CON-\"&AG7&\"-\"&AH7","v":"CON-Blue-1/2\""},50,"Blue",{"$f":"IF(ISERROR(INDEX('Part Matrix'!$L:$L, MATCH(E$7, 'Part Matrix'!$T:$T, 0))),\"\",(INDEX('Part Matrix'!$L:$L, MATCH(E$7, 'Part Matrix'!$T:$T, 0))))","v":"1/2\""},{"$f":"\"CON-\"&LEFT(AJ7,3)&\"-\"&AH7","v":"CON-Ang-1/2\""},"Angled",1,{"$f":"\"LABEL-\"&AH7","v":"LABEL-1/2\""},2,"A;FA;FMA;FM;AFM'A;FA;FLM","BB2030N",{"$f":"INDEX('Part Matrix'!$Z:$Z,MATCH(Master!E7,'Part Matrix'!$T:$T))","v":"2030N"},1,"f.smf;lsm;lfms;gm;slgf"]
["002","XahdKLaNDLKAMD;AMD;LAMD;MD;LMD;LKAJD;LKAJ;D;LMJA;LDM","LSIFHJPKSJF;SAMLF'ASLF,",1,{"$f":"IF(ISERROR(RIGHT(IF(H8<>\"none\",H8,IF(L8<>\"none\",L8,IF(P8<>\"none\",P8,\"none\"))),2)),\"\",(RIGHT(IF(H8<>\"none\",H8,IF(L8<>\"none\",L8,IF(P8<>\"none\",P8,\"none\"))),2)))","v":"21"},{"$f":"IF(AND(I8=\"None\",M8=\"None\",Q8=\"None\"),\"\",_xlfn.CONCAT(IF(I8<>\"None\",\"P\",\"\"),IF(M8<>\"None\",\"R\",\"\"),IF(Q8<>\"None\",\"C\",\"\"),SUBSTITUTE(SUBSTITUTE(T8,\"/\",\"\"),\"V\",\"\"),IF(U8<>\"\",U8,\"\"),IF(V8<>\"\",IF(V8=\"Three\",\"3\",\"S\"),\"\"),IF(W8<>\"\",W8&\"_\",\"_\"),IF(Z8<>\"\",Z8,\"\"),IF(AA8<>\"\",AA8,\"\"),IF(AB8<>\"\",AB8&\"_\",\"_\"),IF(AF8<>\"\",AF8,\"\"),IF(AG8<>\"\",LEFT(AG8,1)&\"_\",\"_\"),IF(AK8<>\"\",\"LT\",\"\"),IF(AK8<>\"\",UPPER(LEFT(AJ8,2)),\"\"),\"\"))","v":"PR3476003034_50105_50B_LTST"},{"$f":"IF(F8=\"\",\"\",IF(E8 = \"\",\"\",Z8&\"ft, \"&T8&\", \"&U8&\"A\"&\",\"&V8&\" Phase \"&W8&\"P, \"&AF8&\"ft \"&\"Conduit,\"&AG8&\" \"&AH8))","v":"50ft, 347/600V, 30A,Three Phase 4P, 50ft Conduit,Blue 0.75\""},{"$f":"I8&\"-\"&VLOOKUP(Master!I8,'Part Matrix'!$A:$T,20,0)","v":"530P5W-21"},"530P5W",1,"Near End",{"$f":"M8&\"-\"&VLOOKUP(Master!M8,'Part Matrix'!$B:$T,19,0)","v":"520R9W-08"},"520R9W",1,"Select End",{"$f":"Q8&\"-\"&VLOOKUP(Master!Q8,'Part Matrix'!$C:$T,18,0)","v":"None-00"},"None",0,"Select End",{"$f":"IF(ISERROR(INDEX('Part Matrix'!$G:$G, MATCH(E$8, 'Part Matrix'!$T:$T, 0))),\"\",(INDEX('Part Matrix'!$G:$G, MATCH(E$8, 'Part Matrix'!$T:$T, 0))))","v":"347/600V"},{"$f":"IF(ISERROR(INDEX('Part Matrix'!$H:$H, MATCH(E$8, 'Part Matrix'!$T:$T, 0))),\"\",(INDEX('Part Matrix'!$H:$H, MATCH(E$8, 'Part Matrix'!$T:$T, 0))))","v":30},{"$f":"IF(ISERROR(INDEX('Part Matrix'!$F:$F, MATCH(E$8, 'Part Matrix'!$T:$T, 0))),\"\",(INDEX('Part Matrix'!$F:$F, MATCH(E$8, 'Part Matrix'!$T:$T, 0))))","v":"Three"},{"$f":"IF(ISERROR(INDEX('Part Matrix'!$J:$J, MATCH(E$8, 'Part Matrix'!$T:$T, 0))),\"\",(INDEX('Part Matrix'!$J:$J, MATCH(E$8, 'Part Matrix'!$T:$T, 0))))","v":4},{"$f":"LEFT(Y8,4)&\"-\"&AA8&\"-\"&AB8","v":"THHN-10-5"},"THHN / THWN / THWN-2",50,{"$f":"IF(ISERROR(INDEX('Part Matrix'!$E:$E, MATCH(E$8, 'Part Matrix'!$T:$T, 0))),\"\",INDEX('Part Matrix'!$E:$E, MATCH(E$8, 'Part Matrix'!$T:$T, 0)))","v":10},{"$f":"IF(ISERROR(INDEX('Part Matrix'!$I:$I, MATCH(E$8, 'Part Matrix'!$T:$T, 0))),\"\",(INDEX('Part Matrix'!$I:$I, MATCH(E$8, 'Part Matrix'!$T:$T, 0))))","v":5},{"$f":"\"FER-\"&AA8","v":"FER-10"},3,{"$f":"\"CON-\"&AG8&\"-\"&AH8","v":"CON-Blue-0.75\""},50,"Blue",{"$f":"IF(ISERROR(INDEX('Part Matrix'!$L:$L, MATCH(E$8, 'Part Matrix'!$T:$T, 0))),\"\",(INDEX('Part Matrix'!$L:$L, MATCH(E$8, 'Part Matrix'!$T:$T, 0))))","v":"0.75\""},{"$f":"\"CON-\"&LEFT(AJ8,3)&\"-\"&AH8","v":"CON-Str-0.75\""},"Straight",1,{"$f":"\"LABEL-\"&AH8","v":"LABEL-0.75\""},2,"A;FA;FMA;FM;AFM'A;FA;FLM","BB2030N",{"$f":"INDEX('Part Matrix'!$Z:$Z,MATCH(Master!E8,'Part Matrix'!$T:$T))","v":"2030N"},1,"f.smf;lsm;lfms;gm;slgf"]

{"sheet":"Configurator","index":2,"n_rows":32,"n_cols":54,"rows_kept":32,"cut":false,"hidden":false,"merged":[[4,0,4,6],[4,7,4,22],[4,23,4,26],[4,27,4,31],[4,32,4,37],[5,8,5,10],[5,12,5,14],[5,16,5,18],[5,20,5,22],[4,41,4,47],[4,38,4,40],[5,44,5,46]]}
[]
[null,null,null,null,null,"Click Icon to Submit Request via Email"]
[null,null,null,null,null,{"$f":"IF(AD8>150,\"Please confirm the conductor size in column AE\",\"\")","v":""}]
[]
["GENERAL INFORMATION",null,null,null,null,null,null,"CONNECTION DEVICE",null,null,null,null,null,null,null,null,null,null,null,null,null,null,null,"ELECTRICAL SPECS",null,null,null,"CABLE DETAILS",null,null,null,null,"CONDUIT DETAILS",null,null,null,null,null,"ADAPTERS",null,null,"OTHER"]
[null,null,null,null,null,null,null,null,"PLUG (Male)",null,null,null,"CONNECTOR (Female)",null,null,null,"RECEPTACLE (Female)",null,null,null,"INLET (Male)",null,null,null,null,null,null,null,null,null,null,null,null,null,null,null,null,null,null,null,null,null,null,null,"Back Box"]
["Line","Project Name","Location","Whip Qty","CONFIG","Whip Part Number","Whip Description","GCG PART NBR","Part","Qty","Select End","GCG PART NBR","Part","Qty","Select End","GCG PART NBR","Part","Qty","Select End","GCG PART NBR","Part","Qty","Select End","Voltage","Amperage","Phase","Poles","GCG PART NBR","Wire Insulation Type","Qty (FT)","Min. Conductor Size (AWG)","# Wires","GCG PART NBR","Type","Qty (FT)","Color","Custom Color Comments","Trade Size","GCG PART NBR","Type","Qty","LABELS","QTY","Label Instructions","Recommended Back Box","Part","Qty","Additional Needs i.e. Mounting Hardware, Circuit Breakers.  Please specify."]
["001","Example","Test",1,{"$f":"RIGHT(IF(I8<>\"none\",H8,IF(Q8<>\"none\",P8,IF(M8<>\"none\",L8,IF(U8<>\"none\",T8,IF(H8<>\"\",H8,IF(P8<>\"\",P8,IF(L8<>\"\",T8,IF(T8<>\"\",T8,)))))))),2)","v":"02"},{"$f":"IF(E8=\"\",\"\",IF(AND(I8=\"None\",M8=\"None\",Q8=\"None\",U8=\"None\"),\"\",_xlfn.CONCAT(IF(I8<>\"None\",\"P\",\"\"),IF(Q8<>\"None\",\"R\",\"\"),IF(U8<>\"None\",\"I\",\"\"),IF(M8<>\"None\",\"C\",\"\"),SUBSTITUTE(SUBSTITUTE(X8,\"/\",\"\"),\"V\",\"\"),IF(Y8<>\"\",Y8,\"\"),IF(Z8<>\"\",IF(Z8=\"Three\",\"3\",\"S\"),\"\"),IF(AA8<>\"\",AA8&\"-\",\"-\"),IF(AD8<>\"\",AD8,\"\"),IF(AE8<>\"\",AE8,\"\"),IF(AF8<>\"\",AF8&\"-\",\"-\"),IF(AI8<>\"\",AI8,\"\"),IF(AJ8<>\"\",LEFT(AJ8,1)&\"-\",\"-\"),IF(AO8<>\"\",\"LT\",\"\"),IF(AO8<>\"\",UPPER(LEFT(AN8,2)),\"\"),\"\")))","v":"PC25020S2-20123-20G-LTST"},{"$f":"IF(F8=\"\",\"\",IF(E8 = \"\",\"\",AD8&\"ft, \"&X8&\", \"&Y8&\"A\"&\",\"&Z8&\" Phase \"&AA8&\"P, \"&AI8&\"ft \"&\"Conduit,\"&AJ8&\" \"&AL8))","v":"20ft, 250V, 20A,Single Phase 2P, 20ft Conduit,Gray 1/2\""},{"$f":"IF(I8=\"\",\"\",I8&\"-\"&VLOOKUP(Configurator!I8,'Part Matrix'!$A:$T,20,0))","v":"320P6W-02"},"320P6W",1,"Near End",{"$f":"IF(M8=\"\",\"\",M8&\"-\"&VLOOKUP(Configurator!M8,'Part Matrix'!$C:$T,18,0))","v":"320C6W-02"},"320C6W",1,"Far End",{"$f":"IF(Q8=\"\",\"\",Q8&\"-\"&VLOOKUP(Configurator!Q8,'Part Matrix'!$B:$T,19,0))","v":"None-00"},"None",null,"None",{"$f":"IF(U8=\"\",\"\",U8&\"-\"&VLOOKUP(Configurator!U8,'Part Matrix'!$D:$T,17,0))","v":"None-00"},"None",null,"None",{"$f":"IF(ISERROR(INDEX('Part Matrix'!$G:$G, MATCH(E$8, 'Part Matrix'!$T:$T, 0))),\"\",(INDEX('Part Matrix'!$G:$G, MATCH(E$8, 'Part Matrix'!$T:$T, 0))))","v":"250V"},{"$f":"IF(ISERROR(INDEX('Part Matrix'!$H:$H, MATCH(E$8, 'Part Matrix'!$T:$T, 0))),\"\",(INDEX('Part Matrix'!$H:$H, MATCH(E$8, 'Part Matrix'!$T:$T, 0))))","v":20},{"$f":"IF(ISERROR(INDEX('Part Matrix'!$F:$F, MATCH(E$8, 'Part Matrix'!$T:$T, 0))),\"\",(INDEX('Part Matrix'!$F:$F, MATCH(E$8, 'Part Matrix'!$T:$T, 0))))","v":"Single"},{"$f":"IF(ISERROR(INDEX('Part Matrix'!$J:$J, MATCH(E$8, 'Part Matrix'!$T:$T, 0))),\"\",(INDEX('Part Matrix'!$J:$J, MATCH(E$8, 'Part Matrix'!$T:$T, 0))))","v":2},{"$f":"IF(AC8=\"\",\"\",LEFT(AC8,4)&\"-\"&AE8&\"-\"&AF8)","v":"Sele-12-3"},"Select Insulation Type",20,{"$f":"IF(ISERROR(INDEX('Part Matrix'!$E:$E, MATCH(E$8, 'Part Matrix'!$T:$T, 0))),\"\",INDEX('Part Matrix'!$E:$E, MATCH(E$8, 'Part Matrix'!$T:$T, 0)))","v":12},{"$f":"IF(ISERROR(INDEX('Part Matrix'!$I:$I, MATCH(E$8, 'Part Matrix'!$T:$T, 0))),\"\",(INDEX('Part Matrix'!$I:$I, MATCH(E$8, 'Part Matrix'!$T:$T, 0))))","v":3},{"$f":"IF(AH8=\"Select Conduit Type\",\"\",AH8&\"-\"&AL8&\"-\"&IF(AJ8=\"Blue\",\"BLU\",IF(AJ8=\"Red\",\"RED\",IF(AJ8=\"GRAY\",\"GRY\",IF(AJ8=\"BLACK\",\"BLK\",\"CUSTOM\")))))","v":""},"Select Conduit Type",20,"Gray",null,{"$f":"IF(ISERROR(VLOOKUP(_xlfn.CONCAT(AE8:AF8),'Part Matrix'!$AP:$AS,4,0)),0,(VLOOKUP(_xlfn.CONCAT(AE8:AF8),'Part Matrix'!$AP:$AS,4,0)))","v":"1/2\""},{"$f":"IF(ISERROR(VLOOKUP(_xlfn.CONCAT(AF8:AG8),'Part Matrix'!$AP:$AS,4,0)),0,(VLOOKUP(_xlfn.CONCAT(AF8:AG8),'Part Matrix'!$AP:$AS,4,0)))","v":0},"Straight",1,{"$f":"IF(D8=\"\",\"\",IF(AQ8=\"\",\"\",\"LBL-\"&AL8))","v":"LBL-1/2\""},{"$f":"IF(D8=\"\",\"\",2)","v":2},null,{"$f":"IF(ISERROR(INDEX('Part Matrix'!$Z:$Z,MATCH(Configurator!E8,'Part Matrix'!$T:$T))),\"\",(INDEX('Part Matrix'!$Z:$Z,MATCH(Configurator!E8,'Part Matrix'!$T:$T))))","v":"2030N"},null,null,null,{"$f":"RIGHT(H8,2)","v":"02"},{"$f":"RIGHT(L8,2)","v":"02"},{"$f":"RIGHT(P8,2)","v":"00"},{"$f":"RIGHT(T8,2)","v":"00"},{"$f":"IF(COUNTIF(AW8:AZ8,\"<>00\")=0,\"Equal\",IF(COUNTIF(AW8:AZ8,\"<>00\")<2,\"All Ignored\",IF(SUMPRODUCT((AW8:AZ8<>\"00\")*(AW8:AZ8<>INDEX(AW8:AZ8,MATCH(TRUE,AW8:AZ8<>\"00\",0))))=0,\"Equal\",\"Connection Device Not Compatible\")))","v":"Equal"},{"$f":"COUNTIF(I8, \"<>None\") + COUNTIF(M8, \"<>None\") + COUNTIF(Q8, \"<>None\") + COUNTIF(U8, \"<>None\")","v":2}]
["002",null,null,null,{"$f":"RIGHT(IF(I9<>\"none\",H9,IF(Q9<>\"none\",P9,IF(M9<>\"none\",L9,IF(U9<>\"none\",T9,IF(H9<>\"\",H9,IF(P9<>\"\",P9,IF(L9<>\"\",T9,IF(T9<>\"\",T9,)))))))),2)","v":"00"},{"$f":"IF(E9=\"\",\"\",IF(AND(I9=\"None\",M9=\"None\",Q9=\"None\",U9=\"None\"),\"\",_xlfn.CONCAT(IF(I9<>\"None\",\"P\",\"\"),IF(Q9<>\"None\",\"R\",\"\"),IF(U9<>\"None\",\"I\",\"\"),IF(M9<>\"None\",\"C\",\"\"),SUBSTITUTE(SUBSTITUTE(X9,\"/\",\"\"),\"V\",\"\"),IF(Y9<>\"\",Y9,\"\"),IF(Z9<>\"\",IF(Z9=\"Three\",\"3\",\"S\"),\"\"),IF(AA9<>\"\",AA9&\"-\",\"-\"),IF(AD9<>\"\",AD9,\"\"),IF(AE9<>\"\",AE9,\"\"),IF(AF9<>\"\",AF9&\"-\",\"-\"),IF(AI9<>\"\",AI9,\"\"),IF(AJ9<>\"\",LEFT(AJ9,1)&\"-\",\"-\"),IF(AO9<>\"\",\"LT\",\"\"),IF(AO9<>\"\",UPPER(LEFT(AN9,2)),\"\"),\"\")))","v":""},"",{"$f":"IF(I9=\"\",\"\",I9&\"-\"&VLOOKUP(Configurator!I9,'Part Matrix'!$A:$T,20,0))","v":"None-00"},"None",null,"None",{"$f":"IF(M9=\"\",\"\",M9&\"-\"&VLOOKUP(Configurator!M9,'Part Matrix'!$C:$T,18,0))","v":"None-00"},"None",null,"None",{"$f":"IF(Q9=\"\",\"\",Q9&\"-\"&VLOOKUP(Configurator!Q9,'Part Matrix'!$B:$T,19,0))","v":"None-00"},"None",null,"None",{"$f":"IF(U9=\"\",\"\",U9&\"-\"&VLOOKUP(Configurator!U9,'Part Matrix'!$D:$T,17,0))","v":"None-00"},"None",null,"None",{"$f":"IF(ISERROR(INDEX('Part Matrix'!$G:$G, MATCH(E$9, 'Part Matrix'!$T:$T, 0))),\"\",(INDEX('Part Matrix'!$G:$G, MATCH(E$9, 'Part Matrix'!$T:$T, 0))))","v":0},{"$f":"IF(ISERROR(INDEX('Part Matrix'!$H:$H, MATCH(E$9, 'Part Matrix'!$T:$T, 0))),\"\",(INDEX('Part Matrix'!$H:$H, MATCH(E$9, 'Part Matrix'!$T:$T, 0))))","v":0},{"$f":"IF(ISERROR(INDEX('Part Matrix'!$F:$F, MATCH(E$9, 'Part Matrix'!$T:$T, 0))),\"\",(INDEX('Part Matrix'!$F:$F, MATCH(E$9, 'Part Matrix'!$T:$T, 0))))","v":0},{"$f":"IF(ISERROR(INDEX('Part Matrix'!$J:$J, MATCH(E$9, 'Part Matrix'!$T:$T, 0))),\"\",(INDEX('Part Matrix'!$J:$J, MATCH(E$9, 'Part Matrix'!$T:$T, 0))))","v":0},{"$f":"IF(AC9=\"\",\"\",LEFT(AC9,4)&\"-\"&AE9&\"-\"&AF9)","v":"Sele-0-0"},"Select Insulation Type",null,{"$f":"IF(ISERROR(INDEX('Part Matrix'!$E:$E, MATCH(E$9, 'Part Matrix'!$T:$T, 0))),\"\",INDEX('Part Matrix'!$E:$E, MATCH(E$9, 'Part Matrix'!$T:$T, 0)))","v":0},{"$f":"IF(ISERROR(INDEX('Part Matrix'!$I:$I, MATCH(E$9, 'Part Matrix'!$T:$T, 0))),\"\",(INDEX('Part Matrix'!$I:$I, MATCH(E$9, 'Part Matrix'!$T:$T, 0))))","v":0},{"$f":"IF(AH9=\"Select Conduit Type\",\"\",AH9&\"-\"&AL9&\"-\"&IF(AJ9=\"Blue\",\"BLU\",IF(AJ9=\"Red\",\"RED\",IF(AJ9=\"GRAY\",\"GRY\",IF(AJ9=\"BLACK\",\"BLK\",\"CUSTOM\")))))","v":""},"Select Conduit Type",null,null,null,{"$f":"IF(ISERROR(VLOOKUP(_xlfn.CONCAT(AE9:AF9),'Part Matrix'!$AP:$AS,4,0)),0,(VLOOKUP(_xlfn.CONCAT(AE9:AF9),'Part Matrix'!$AP:$AS,4,0)))","v":0},{"$f":"IF(AN9=\"None\",\"\",IF(AN9=\"\",\"\",AH9&\"-\"&\"FITTING-\"&TRIM(LEFT(AN9,3))&\"-\"&AL9))","v":""},null,null,{"$f":"IF(D9=\"\",\"\",IF(AQ9=\"\",\"\",\"LBL-\"&AL9))","v":""},{"$f":"IF(D9=\"\",\"\",2)","v":""},null,{"$f":"IF(ISERROR(INDEX('Part Matrix'!$Z:$Z,MATCH(Configurator!E9,'Part Matrix'!$T:$T))),\"\",(INDEX('Part Matrix'!$Z:$Z,MATCH(Configurator!E9,'Part Matrix'!$T:$T))))","v":0},null,null,null,{"$f":"RIGHT(H9,2)","v":"00"},{"$f":"RIGHT(L9,2)","v":"00"},{"$f":"RIGHT(P9,2)","v":"00"},{"$f":"RIGHT(T9,2)","v":"00"},{"$f":"IF(COUNTIF(AW9:AZ9,\"<>00\")=0,\"Equal\",IF(COUNTIF(AW9:AZ9,\"<>00\")<2,\"All Ignored\",IF(SUMPRODUCT((AW9:AZ9<>\"00\")*(AW9:AZ9<>INDEX(AW9:AZ9,MATCH(TRUE,AW9:AZ9<>\"00\",0))))=0,\"Equal\",\"Connection Device Not Compatible\")))","v":{"$error":"#N/A"}},{"$f":"COUNTIF(I9, \"<>None\") + COUNTIF(M9, \"<>None\") + COUNTIF(Q9, \"<>None\") + COUNTIF(U9, \"<>None\")","v":0}]
["003",null,null,null,"00",{"$f":"IF(E10=\"\",\"\",IF(AND(I10=\"None\",M10=\"None\",Q10=\"None\",U10=\"None\"),\"\",_xlfn.CONCAT(IF(I10<>\"None\",\"P\",\"\"),IF(Q10<>\"None\",\"R\",\"\"),IF(U10<>\"None\",\"I\",\"\"),IF(M10<>\"None\",\"C\",\"\"),SUBSTITUTE(SUBSTITUTE(X10,\"/\",\"\"),\"V\",\"\"),IF(Y10<>\"\",Y10,\"\"),IF(Z10<>\"\",IF(Z10=\"Three\",\"3\",\"S\"),\"\"),IF(AA10<>\"\",AA10&\"-\",\"-\"),IF(AD10<>\"\",AD10,\"\"),IF(AE10<>\"\",AE10,\"\"),IF(AF10<>\"\",AF10&\"-\",\"-\"),IF(AI10<>\"\",AI10,\"\"),IF(AJ10<>\"\",LEFT(AJ10,1)&\"-\",\"-\"),IF(AO10<>\"\",\"LT\",\"\"),IF(AO10<>\"\",UPPER(LEFT(AN10,2)),\"\"),\"\")))","v":""},"",{"$f":"IF(I10=\"\",\"\",I10&\"-\"&VLOOKUP(Configurator!I10,'Part Matrix'!$A:$T,20,0))","v":"None-00"},"None",null,"None",{"$f":"IF(M10=\"\",\"\",M10&\"-\"&VLOOKUP(Configurator!M10,'Part Matrix'!$C:$T,18,0))","v":"None-00"},"None",null,"None",{"$f":"IF(Q10=\"\",\"\",Q10&\"-\"&VLOOKUP(Configurator!Q10,'Part Matrix'!$B:$T,19,0))","v":"None-00"},"None",null,"None",{"$f":"IF(U10=\"\",\"\",U10&\"-\"&VLOOKUP(Configurator!U10,'Part Matrix'!$D:$T,17,0))","v":"None-00"},"None",null,"None",{"$f":"IF(ISERROR(INDEX('Part Matrix'!$G:$G, MATCH(E$10, 'Part Matrix'!$T:$T, 0))),\"\",(INDEX('Part Matrix'!$G:$G, MATCH(E$10, 'Part Matrix'!$T:$T, 0))))","v":0},{"$f":"IF(ISERROR(INDEX('Part Matrix'!$H:$H, MATCH(E$10, 'Part Matrix'!$T:$T, 0))),\"\",(INDEX('Part Matrix'!$H:$H, MATCH(E$10, 'Part Matrix'!$T:$T, 0))))","v":0},{"$f":"IF(ISERROR(INDEX('Part Matrix'!$F:$F, MATCH(E$10, 'Part Matrix'!$T:$T, 0))),\"\",(INDEX('Part Matrix'!$F:$F, MATCH(E$10, 'Part Matrix'!$T:$T, 0))))","v":0},{"$f":"IF(ISERROR(INDEX('Part Matrix'!$J:$J, MATCH(E$10, 'Part Matrix'!$T:$T, 0))),\"\",(INDEX('Part Matrix'!$J:$J, MATCH(E$10, 'Part Matrix'!$T:$T, 0))))","v":0},"Sele-0-0","Select Insulation Type",null,{"$f":"IF(ISERROR(INDEX('Part Matrix'!$E:$E, MATCH(E$10, 'Part Matrix'!$T:$T, 0))),\"\",INDEX('Part Matrix'!$E:$E, MATCH(E$10, 'Part Matrix'!$T:$T, 0)))","v":0},{"$f":"IF(ISERROR(INDEX('Part Matrix'!$I:$I, MATCH(E$10, 'Part Matrix'!$T:$T, 0))),\"\",(INDEX('Part Matrix'!$I:$I, MATCH(E$10, 'Part Matrix'!$T:$T, 0))))","v":0},"","Select Conduit Type",null,null,null,{"$f":"IF(ISERROR(VLOOKUP(_xlfn.CONCAT(AE10:AF10),'Part Matrix'!$AP:$AS,4,0)),0,(VLOOKUP(_xlfn.CONCAT(AE10:AF10),'Part Matrix'!$AP:$AS,4,0)))","v":0},"",null,null,{"$f":"IF(D10=\"\",\"\",IF(AQ10=\"\",\"\",\"LBL-\"&AL10))","v":""},"",null,{"$f":"IF(ISERROR(INDEX('Part Matrix'!$Z:$Z,MATCH(Configurator!E10,'Part Matrix'!$T:$T))),\"\",(INDEX('Part Matrix'!$Z:$Z,MATCH(Configurator!E10,'Part Matrix'!$T:$T))))","v":0},null,null,null,"00","00","00","00",{"$f":"IF(COUNTIF(AW10:AZ10,\"<>00\")=0,\"Equal\",IF(COUNTIF(AW10:AZ10,\"<>00\")<2,\"All Ignored\",IF(SUMPRODUCT((AW10:AZ10<>\"00\")*(AW10:AZ10<>INDEX(AW10:AZ10,MATCH(TRUE,AW10:AZ10<>\"00\",0))))=0,\"Equal\",\"Connection Device Not Compatible\")))","v":{"$error":"#N/A"}},0]
{"$rows_left_out":23}
{"sheet":"BOM_Summary","index":3,"n_rows":11,"n_cols":18,"rows_kept":11,"cut":false,"hidden":true,"merged":[]}
["Line","Config#","Description","Part","Qty","Total Qty","Config",null,null,null,null,null,null,null,"Row Labels","Sum of Total Qty"]
[1,"PC48020S2-40123-40G-LTST","40ft, 480V, 20A,Single Phase 2P, 40ft Conduit,Gray 1/2\"","320P7W",1,1,"03",null,null,null,null,null,null,null,"LBL-1/2\"",2,null,"Run Report"]
[1,"PC48020S2-40123-40G-LTST","40ft, 480V, 20A,Single Phase 2P, 40ft Conduit,Gray 1/2\"","320C7W",1,1,"03",null,null,null,null,null,null,null,"2030N",1]
[1,"PC48020S2-40123-40G-LTST","40ft, 480V, 20A,Single Phase 2P, 40ft Conduit,Gray 1/2\"","THHNBC-12AWG-0",40,40,"03",null,null,null,null,null,null,null,"320P7W",1]
[1,"PC48020S2-40123-40G-LTST","40ft, 480V, 20A,Single Phase 2P, 40ft Conduit,Gray 1/2\"","THHNBC-12AWG-9",40,40,"03",null,null,null,null,null,null,null,"320C7W",1]
[1,"PC48020S2-40123-40G-LTST","40ft, 480V, 20A,Single Phase 2P, 40ft Conduit,Gray 1/2\"","THHNBC-12AWG-5",40,40,"03",null,null,null,null,null,null,null,"LFMC-1/2\"-GRY",40]
[1,"PC48020S2-40123-40G-LTST","40ft, 480V, 20A,Single Phase 2P, 40ft Conduit,Gray 1/2\"","LFMC-1/2\"-GRY",40,40,"03",null,null,null,null,null,null,null,"LFMC-FITTING-Str-1/2\"",40]
[1,"PC48020S2-40123-40G-LTST","40ft, 480V, 20A,Single Phase 2P, 40ft Conduit,Gray 1/2\"","LFMC-FITTING-Str-1/2\"",40,40,"03",null,null,null,null,null,null,null,"THHNBC-12AWG-0",40]
[1,"PC48020S2-40123-40G-LTST","40ft, 480V, 20A,Single Phase 2P, 40ft Conduit,Gray 1/2\"","LBL-1/2\"",2,2,"03",null,null,null,null,null,null,null,"THHNBC-12AWG-9",40]
[1,"PC48020S2-40123-40G-LTST","40ft, 480V, 20A,Single Phase 2P, 40ft Conduit,Gray 1/2\"","2030N",1,1,"03",null,null,null,null,null,null,null,"THHNBC-12AWG-5",40]
{"$rows_left_out":1}